{"text_format":"1","workbook":"xlsx","n_sheets":7,"sheets":["Anleitung","Vereinsanmeldung","Personenerfassung","Gruppenübersicht","Auswahlfelder","Altersstufe","Hilfsliste_Gruppen"],"not_rendered":{"charts":0,"images":3,"macros":1,"external_links":0,"defined_names":5,"comments":1,"pivot_tables":0},"unopened":[],"bounds":{"document_bytes":16777216,"sheet_cells":100000,"rows_first":2000,"rows_last":500,"rows_between":2000,"halvings":0,"cell_chars":16384,"cell_head_chars":4096},"cells_cut":0,"cells_raw":0,"read":"whole","date_system":"1900"}

{"sheet":"Anleitung","index":0,"n_rows":33,"n_cols":4,"rows_kept":33,"cut":false,"hidden":false,"merged":[[10,1,11,7],[13,1,14,7]]}
[]
[]
[null,null,null,"Verband"]
[null,null,null,"der Sportschützen Zürich"]
[null,null,null,"und Umgebung"]
[]
[]
["Anleitung Anmeldung Verbandsschiessen"]
[]
[]
["1)","Datei zuerst öffnen und abspeichern, sofern noch nicht lokal gespeichert. Die Sicherheitswarnung (gelb) \"Inhalt aktivieren\" (dies ist für die automatischen Funktionen zwingend notwendig) bestätigen."]
[]
["2)","Beim Erfassen Daten nicht mit Drag&Drop verschieben!"]
[null,"(Ansonsten funktioniert es nicht mehr - falls irrtümlich doch gemacht, mit \"Rückgänig\" wieder richtig stellen.)"]
[]
{"$rows_left_out":19}
{"sheet":"Vereinsanmeldung","index":1,"n_rows":44,"n_cols":7,"rows_kept":44,"cut":false,"hidden":false,"merged":[[35,2,35,6],[37,2,37,6],[39,2,39,6],[41,2,41,6],[43,2,43,6],[23,2,23,6],[27,2,27,3],[27,5,27,6],[18,2,18,5],[21,2,21,5],[25,2,25,5]]}
[]
[]
[]
[]
[]
[]
["Verband"]
["der Sportschützen Zürich"]
["und Umgebung"]
[]
[]
[]
["VERBANDSSCHIESSEN"]
["Vereins-Anmeldung",null,null,null,null,null,2024]
[]
{"$rows_left_out":30}
{"sheet":"Personenerfassung","index":2,"n_rows":39,"n_cols":29,"rows_kept":39,"cut":false,"hidden":false,"merged":[[0,4,0,8],[2,7,3,7],[2,5,3,5],[2,0,3,0],[2,1,3,1],[2,3,3,3],[2,4,3,4],[2,6,3,6]]}
["Erfassung Schützen von:",null,null,null,{"$f":"IF(Vereinsanmeldung!C19=\"\",\"\",Vereinsanmeldung!C19)","v":""}]
[]
["Nr.","Grp-Nr.",null,"Lizenznummer","Name","Vorname","Jg","V/J","frei"]
[null,null,null,null,null,null,null,null,"aufg.",null,null,null,null,null,1,2,3,4,5,1,2,3,4,5,1,2,3,4,5]
[0]
[{"$f":"A5+1","v":1},null,{"$f":"SUM(Y6:AC6)","v":0},null,null,null,null,{"$f":"VLOOKUP(G6,Altersstufe!$E$6:$F$94,2,FALSE)","v":" "},null,null,{"$f":"IF(OR(M6>0,D6>0),\"\",\"Lizenznummer fehlt !!!\")","v":""},{"$f":"IF(OR(M6>0,I6>0),\"\",\"Angabe Stellung fehlt !!!\")","v":""},{"$f":"IF(E6>\"\",0,1)","v":1},{"$f":"B6-ROW()/100","v":-0.06},{"$f":"IF(AND(N6<1,N6>0),N6,\"\")","v":""},{"$f":"IF(AND(N6<2,N6>1),N6,\"\")","v":""},{"$f":"IF(AND(N6<3,N6>2),N6,\"\")","v":""},{"$f":"IF(AND(N6<4,N6>3),N6,\"\")","v":""},{"$f":"IF(AND(N6<5,N6>4),N6,\"\")","v":""},{"$f":"IF(O6=\"\",\"\",RANK(O6,$O$6:$O$35))","v":""},{"$f":"IF(P6=\"\",\"\",RANK(P6,$P$6:$P$35))","v":""},{"$f":"IF(Q6=\"\",\"\",RANK(Q6,$Q$5:$Q$34))","v":""},{"$f":"IF(R6=\"\",\"\",RANK(R6,$R$5:$R$34))","v":""},{"$f":"IF(S6=\"\",\"\",RANK(S6,$S$5:$S$34))","v":""},{"$f":"IF(T6=\"\",\"\",T6/10+1)","v":""},{"$f":"IF(U6=\"\",\"\",U6/10+2)","v":""},{"$f":"IF(V6=\"\",\"\",V6/10+3)","v":""},{"$f":"IF(W6=\"\",\"\",W6/10+4)","v":""},{"$f":"IF(X6=\"\",\"\",X6/10+5)","v":""}]
[{"$f":"A6+1","v":2},null,{"$f":"SUM(Y7:AC7)","v":0},null,null,null,null,{"$f":"VLOOKUP(G7,Altersstufe!$E$6:$F$94,2,FALSE)","v":" "},null,null,{"$f":"IF(OR(M7>0,D7>0),\"\",\"Lizenznummer fehlt !!!\")","v":""},{"$f":"IF(OR(M7>0,I7>0),\"\",\"Angabe Stellung fehlt !!!\")","v":""},{"$f":"IF(E7>\"\",0,1)","v":1},{"$f":"B7-ROW()/100","v":-7.0000000000000007E-2},{"$f":"IF(AND(N7<1,N7>0),N7,\"\")","v":""},{"$f":"IF(AND(N7<2,N7>1),N7,\"\")","v":""},{"$f":"IF(AND(N7<3,N7>2),N7,\"\")","v":""},{"$f":"IF(AND(N7<4,N7>3),N7,\"\")","v":""},{"$f":"IF(AND(N7<5,N7>4),N7,\"\")","v":""},{"$f":"IF(O7=\"\",\"\",RANK(O7,$O$6:$O$35))","v":""},{"$f":"IF(P7=\"\",\"\",RANK(P7,$P$6:$P$35))","v":""},{"$f":"IF(Q7=\"\",\"\",RANK(Q7,$Q$5:$Q$34))","v":""},{"$f":"IF(R7=\"\",\"\",RANK(R7,$R$5:$R$34))","v":""},{"$f":"IF(S7=\"\",\"\",RANK(S7,$S$5:$S$34))","v":""},{"$f":"IF(T7=\"\",\"\",T7/10+1)","v":""},{"$f":"IF(U7=\"\",\"\",U7/10+2)","v":""},{"$f":"IF(V7=\"\",\"\",V7/10+3)","v":""},{"$f":"IF(W7=\"\",\"\",W7/10+4)","v":""},{"$f":"IF(X7=\"\",\"\",X7/10+5)","v":""}]
[{"$f":"A7+1","v":3},null,{"$f":"SUM(Y8:AC8)","v":0},null,null,null,null,{"$f":"VLOOKUP(G8,Altersstufe!$E$6:$F$94,2,FALSE)","v":" "},null,null,{"$f":"IF(OR(M8>0,D8>0),\"\",\"Lizenznummer fehlt !!!\")","v":""},{"$f":"IF(OR(M8>0,I8>0),\"\",\"Angabe Stellung fehlt !!!\")","v":""},{"$f":"IF(E8>\"\",0,1)","v":1},{"$f":"B8-ROW()/100","v":-0.08},{"$f":"IF(AND(N8<1,N8>0),N8,\"\")","v":""},{"$f":"IF(AND(N8<2,N8>1),N8,\"\")","v":""},{"$f":"IF(AND(N8<3,N8>2),N8,\"\")","v":""},{"$f":"IF(AND(N8<4,N8>3),N8,\"\")","v":""},{"$f":"IF(AND(N8<5,N8>4),N8,\"\")","v":""},{"$f":"IF(O8=\"\",\"\",RANK(O8,$O$6:$O$35))","v":""},{"$f":"IF(P8=\"\",\"\",RANK(P8,$P$6:$P$35))","v":""},{"$f":"IF(Q8=\"\",\"\",RANK(Q8,$Q$5:$Q$34))","v":""},{"$f":"IF(R8=\"\",\"\",RANK(R8,$R$5:$R$34))","v":""},{"$f":"IF(S8=\"\",\"\",RANK(S8,$S$5:$S$34))","v":""},{"$f":"IF(T8=\"\",\"\",T8/10+1)","v":""},{"$f":"IF(U8=\"\",\"\",U8/10+2)","v":""},{"$f":"IF(V8=\"\",\"\",V8/10+3)","v":""},{"$f":"IF(W8=\"\",\"\",W8/10+4)","v":""},{"$f":"IF(X8=\"\",\"\",X8/10+5)","v":""}]
[{"$f":"A8+1","v":4},null,{"$f":"SUM(Y9:AC9)","v":0},null,null,null,null,{"$f":"VLOOKUP(G9,Altersstufe!$E$6:$F$94,2,FALSE)","v":" "},null,null,{"$f":"IF(OR(M9>0,D9>0),\"\",\"Lizenznummer fehlt !!!\")","v":""},{"$f":"IF(OR(M9>0,I9>0),\"\",\"Angabe Stellung fehlt !!!\")","v":""},{"$f":"IF(E9>\"\",0,1)","v":1},{"$f":"B9-ROW()/100","v":-0.09},{"$f":"IF(AND(N9<1,N9>0),N9,\"\")","v":""},{"$f":"IF(AND(N9<2,N9>1),N9,\"\")","v":""},{"$f":"IF(AND(N9<3,N9>2),N9,\"\")","v":""},{"$f":"IF(AND(N9<4,N9>3),N9,\"\")","v":""},{"$f":"IF(AND(N9<5,N9>4),N9,\"\")","v":""},{"$f":"IF(O9=\"\",\"\",RANK(O9,$O$6:$O$35))","v":""},{"$f":"IF(P9=\"\",\"\",RANK(P9,$P$6:$P$35))","v":""},{"$f":"IF(Q9=\"\",\"\",RANK(Q9,$Q$5:$Q$34))","v":""},{"$f":"IF(R9=\"\",\"\",RANK(R9,$R$5:$R$34))","v":""},{"$f":"IF(S9=\"\",\"\",RANK(S9,$S$5:$S$34))","v":""},{"$f":"IF(T9=\"\",\"\",T9/10+1)","v":""},{"$f":"IF(U9=\"\",\"\",U9/10+2)","v":""},{"$f":"IF(V9=\"\",\"\",V9/10+3)","v":""},{"$f":"IF(W9=\"\",\"\",W9/10+4)","v":""},{"$f":"IF(X9=\"\",\"\",X9/10+5)","v":""}]
[{"$f":"A9+1","v":5},null,{"$f":"SUM(Y10:AC10)","v":0},null,null,null,null,{"$f":"VLOOKUP(G10,Altersstufe!$E$6:$F$94,2,FALSE)","v":" "},null,null,{"$f":"IF(OR(M10>0,D10>0),\"\",\"Lizenznummer fehlt !!!\")","v":""},{"$f":"IF(OR(M10>0,I10>0),\"\",\"Angabe Stellung fehlt !!!\")","v":""},{"$f":"IF(E10>\"\",0,1)","v":1},{"$f":"B10-ROW()/100","v":-0.1},{"$f":"IF(AND(N10<1,N10>0),N10,\"\")","v":""},{"$f":"IF(AND(N10<2,N10>1),N10,\"\")","v":""},{"$f":"IF(AND(N10<3,N10>2),N10,\"\")","v":""},{"$f":"IF(AND(N10<4,N10>3),N10,\"\")","v":""},{"$f":"IF(AND(N10<5,N10>4),N10,\"\")","v":""},{"$f":"IF(O10=\"\",\"\",RANK(O10,$O$6:$O$35))","v":""},{"$f":"IF(P10=\"\",\"\",RANK(P10,$P$6:$P$35))","v":""},{"$f":"IF(Q10=\"\",\"\",RANK(Q10,$Q$5:$Q$34))","v":""},{"$f":"IF(R10=\"\",\"\",RANK(R10,$R$5:$R$34))","v":""},{"$f":"IF(S10=\"\",\"\",RANK(S10,$S$5:$S$34))","v":""},{"$f":"IF(T10=\"\",\"\",T10/10+1)","v":""},{"$f":"IF(U10=\"\",\"\",U10/10+2)","v":""},{"$f":"IF(V10=\"\",\"\",V10/10+3)","v":""},{"$f":"IF(W10=\"\",\"\",W10/10+4)","v":""},{"$f":"IF(X10=\"\",\"\",X10/10+5)","v":""}]
[{"$f":"A10+1","v":6},null,{"$f":"SUM(Y11:AC11)","v":0},null,null,null,null,{"$f":"VLOOKUP(G11,Altersstufe!$E$6:$F$94,2,FALSE)","v":" "},null,null,{"$f":"IF(OR(M11>0,D11>0),\"\",\"Lizenznummer fehlt !!!\")","v":""},{"$f":"IF(OR(M11>0,I11>0),\"\",\"Angabe Stellung fehlt !!!\")","v":""},{"$f":"IF(E11>\"\",0,1)","v":1},{"$f":"B11-ROW()/100","v":-0.11},{"$f":"IF(AND(N11<1,N11>0),N11,\"\")","v":""},{"$f":"IF(AND(N11<2,N11>1),N11,\"\")","v":""},{"$f":"IF(AND(N11<3,N11>2),N11,\"\")","v":""},{"$f":"IF(AND(N11<4,N11>3),N11,\"\")","v":""},{"$f":"IF(AND(N11<5,N11>4),N11,\"\")","v":""},{"$f":"IF(O11=\"\",\"\",RANK(O11,$O$6:$O$35))","v":""},{"$f":"IF(P11=\"\",\"\",RANK(P11,$P$6:$P$35))","v":""},{"$f":"IF(Q11=\"\",\"\",RANK(Q11,$Q$5:$Q$34))","v":""},{"$f":"IF(R11=\"\",\"\",RANK(R11,$R$5:$R$34))","v":""},{"$f":"IF(S11=\"\",\"\",RANK(S11,$S$5:$S$34))","v":""},{"$f":"IF(T11=\"\",\"\",T11/10+1)","v":""},{"$f":"IF(U11=\"\",\"\",U11/10+2)","v":""},{"$f":"IF(V11=\"\",\"\",V11/10+3)","v":""},{"$f":"IF(W11=\"\",\"\",W11/10+4)","v":""},{"$f":"IF(X11=\"\",\"\",X11/10+5)","v":""}]
[{"$f":"A11+1","v":7},null,{"$f":"SUM(Y12:AC12)","v":0},null,null,null,null,{"$f":"VLOOKUP(G12,Altersstufe!$E$6:$F$94,2,FALSE)","v":" "},null,null,{"$f":"IF(OR(M12>0,D12>0),\"\",\"Lizenznummer fehlt !!!\")","v":""},{"$f":"IF(OR(M12>0,I12>0),\"\",\"Angabe Stellung fehlt !!!\")","v":""},{"$f":"IF(E12>\"\",0,1)","v":1},{"$f":"B12-ROW()/100","v":-0.12},{"$f":"IF(AND(N12<1,N12>0),N12,\"\")","v":""},{"$f":"IF(AND(N12<2,N12>1),N12,\"\")","v":""},{"$f":"IF(AND(N12<3,N12>2),N12,\"\")","v":""},{"$f":"IF(AND(N12<4,N12>3),N12,\"\")","v":""},{"$f":"IF(AND(N12<5,N12>4),N12,\"\")","v":""},{"$f":"IF(O12=\"\",\"\",RANK(O12,$O$6:$O$35))","v":""},{"$f":"IF(P12=\"\",\"\",RANK(P12,$P$6:$P$35))","v":""},{"$f":"IF(Q12=\"\",\"\",RANK(Q12,$Q$5:$Q$34))","v":""},{"$f":"IF(R12=\"\",\"\",RANK(R12,$R$5:$R$34))","v":""},{"$f":"IF(S12=\"\",\"\",RANK(S12,$S$5:$S$34))","v":""},{"$f":"IF(T12=\"\",\"\",T12/10+1)","v":""},{"$f":"IF(U12=\"\",\"\",U12/10+2)","v":""},{"$f":"IF(V12=\"\",\"\",V12/10+3)","v":""},{"$f":"IF(W12=\"\",\"\",W12/10+4)","v":""},{"$f":"IF(X12=\"\",\"\",X12/10+5)","v":""}]
[{"$f":"A12+1","v":8},null,{"$f":"SUM(Y13:AC13)","v":0},null,null,null,null,{"$f":"VLOOKUP(G13,Altersstufe!$E$6:$F$94,2,FALSE)","v":" "},null,null,{"$f":"IF(OR(M13>0,D13>0),\"\",\"Lizenznummer fehlt !!!\")","v":""},{"$f":"IF(OR(M13>0,I13>0),\"\",\"Angabe Stellung fehlt !!!\")","v":""},{"$f":"IF(E13>\"\",0,1)","v":1},{"$f":"B13-ROW()/100","v":-0.13},{"$f":"IF(AND(N13<1,N13>0),N13,\"\")","v":""},{"$f":"IF(AND(N13<2,N13>1),N13,\"\")","v":""},{"$f":"IF(AND(N13<3,N13>2),N13,\"\")","v":""},{"$f":"IF(AND(N13<4,N13>3),N13,\"\")","v":""},{"$f":"IF(AND(N13<5,N13>4),N13,\"\")","v":""},{"$f":"IF(O13=\"\",\"\",RANK(O13,$O$6:$O$35))","v":""},{"$f":"IF(P13=\"\",\"\",RANK(P13,$P$6:$P$35))","v":""},{"$f":"IF(Q13=\"\",\"\",RANK(Q13,$Q$5:$Q$34))","v":""},{"$f":"IF(R13=\"\",\"\",RANK(R13,$R$5:$R$34))","v":""},{"$f":"IF(S13=\"\",\"\",RANK(S13,$S$5:$S$34))","v":""},{"$f":"IF(T13=\"\",\"\",T13/10+1)","v":""},{"$f":"IF(U13=\"\",\"\",U13/10+2)","v":""},{"$f":"IF(V13=\"\",\"\",V13/10+3)","v":""},{"$f":"IF(W13=\"\",\"\",W13/10+4)","v":""},{"$f":"IF(X13=\"\",\"\",X13/10+5)","v":""}]
[{"$f":"A13+1","v":9},null,{"$f":"SUM(Y14:AC14)","v":0},null,null,null,null,{"$f":"VLOOKUP(G14,Altersstufe!$E$6:$F$94,2,FALSE)","v":" "},null,null,{"$f":"IF(OR(M14>0,D14>0),\"\",\"Lizenznummer fehlt !!!\")","v":""},{"$f":"IF(OR(M14>0,I14>0),\"\",\"Angabe Stellung fehlt !!!\")","v":""},{"$f":"IF(E14>\"\",0,1)","v":1},{"$f":"B14-ROW()/100","v":-0.14000000000000001},{"$f":"IF(AND(N14<1,N14>0),N14,\"\")","v":""},{"$f":"IF(AND(N14<2,N14>1),N14,\"\")","v":""},{"$f":"IF(AND(N14<3,N14>2),N14,\"\")","v":""},{"$f":"IF(AND(N14<4,N14>3),N14,\"\")","v":""},{"$f":"IF(AND(N14<5,N14>4),N14,\"\")","v":""},{"$f":"IF(O14=\"\",\"\",RANK(O14,$O$6:$O$35))","v":""},{"$f":"IF(P14=\"\",\"\",RANK(P14,$P$6:$P$35))","v":""},{"$f":"IF(Q14=\"\",\"\",RANK(Q14,$Q$5:$Q$34))","v":""},{"$f":"IF(R14=\"\",\"\",RANK(R14,$R$5:$R$34))","v":""},{"$f":"IF(S14=\"\",\"\",RANK(S14,$S$5:$S$34))","v":""},{"$f":"IF(T14=\"\",\"\",T14/10+1)","v":""},{"$f":"IF(U14=\"\",\"\",U14/10+2)","v":""},{"$f":"IF(V14=\"\",\"\",V14/10+3)","v":""},{"$f":"IF(W14=\"\",\"\",W14/10+4)","v":""},{"$f":"IF(X14=\"\",\"\",X14/10+5)","v":""}]
[{"$f":"A14+1","v":10},null,{"$f":"SUM(Y15:AC15)","v":0},null,null,null,null,{"$f":"VLOOKUP(G15,Altersstufe!$E$6:$F$94,2,FALSE)","v":" "},null,null,{"$f":"IF(OR(M15>0,D15>0),\"\",\"Lizenznummer fehlt !!!\")","v":""},{"$f":"IF(OR(M15>0,I15>0),\"\",\"Angabe Stellung fehlt !!!\")","v":""},{"$f":"IF(E15>\"\",0,1)","v":1},{"$f":"B15-ROW()/100","v":-0.15},{"$f":"IF(AND(N15<1,N15>0),N15,\"\")","v":""},{"$f":"IF(AND(N15<2,N15>1),N15,\"\")","v":""},{"$f":"IF(AND(N15<3,N15>2),N15,\"\")","v":""},{"$f":"IF(AND(N15<4,N15>3),N15,\"\")","v":""},{"$f":"IF(AND(N15<5,N15>4),N15,\"\")","v":""},{"$f":"IF(O15=\"\",\"\",RANK(O15,$O$6:$O$35))","v":""},{"$f":"IF(P15=\"\",\"\",RANK(P15,$P$6:$P$35))","v":""},{"$f":"IF(Q15=\"\",\"\",RANK(Q15,$Q$5:$Q$34))","v":""},{"$f":"IF(R15=\"\",\"\",RANK(R15,$R$5:$R$34))","v":""},{"$f":"IF(S15=\"\",\"\",RANK(S15,$S$5:$S$34))","v":""},{"$f":"IF(T15=\"\",\"\",T15/10+1)","v":""},{"$f":"IF(U15=\"\",\"\",U15/10+2)","v":""},{"$f":"IF(V15=\"\",\"\",V15/10+3)","v":""},{"$f":"IF(W15=\"\",\"\",W15/10+4)","v":""},{"$f":"IF(X15=\"\",\"\",X15/10+5)","v":""}]
{"$rows_left_out":25}
{"sheet":"Gruppenübersicht","index":3,"n_rows":48,"n_cols":6,"rows_kept":48,"cut":false,"hidden":false,"merged":[[41,4,41,5],[3,3,3,5],[8,4,8,5],[17,4,17,5],[25,4,25,5],[33,4,33,5]]}
[null,null,"Verband"]
[null,null,"der Sportschützenvereine Zürich"]
[null,null,"und Umgebung"]
[null,null,null,{"$f":"IF(Vereinsanmeldung!C19>0,Vereinsanmeldung!C19,\"\")","v":""}]
[]
["Verbandsschiessen"]
["Anmeldung zum Gruppenwettkampf"]
[]
["Gruppe:",null,1,"Gruppenname: ",{"$f":"IF(Vereinsanmeldung!C36>0,Vereinsanmeldung!C36,\"\")","v":""}]
[]
[1,null,{"$f":"IF($E$9=\"\",\"\",Hilfsliste_Gruppen!B9)","v":""},{"$f":"IF($E$9=\"\",\"\",Hilfsliste_Gruppen!C9)","v":""},{"$f":"IF($E$9=\"\",\"\",Hilfsliste_Gruppen!D9)","v":""},{"$f":"IF($E$9=\"\",\"\",Hilfsliste_Gruppen!E9)","v":""}]
[2,null,{"$f":"IF($E$9=\"\",\"\",Hilfsliste_Gruppen!B10)","v":""},{"$f":"IF($E$9=\"\",\"\",Hilfsliste_Gruppen!C10)","v":""},{"$f":"IF($E$9=\"\",\"\",Hilfsliste_Gruppen!D10)","v":""},{"$f":"IF($E$9=\"\",\"\",Hilfsliste_Gruppen!E10)","v":""}]
[3,null,{"$f":"IF($E$9=\"\",\"\",Hilfsliste_Gruppen!B11)","v":""},{"$f":"IF($E$9=\"\",\"\",Hilfsliste_Gruppen!C11)","v":""},{"$f":"IF($E$9=\"\",\"\",Hilfsliste_Gruppen!D11)","v":""},{"$f":"IF($E$9=\"\",\"\",Hilfsliste_Gruppen!E11)","v":""}]
[4,null,{"$f":"IF($E$9=\"\",\"\",Hilfsliste_Gruppen!B12)","v":""},{"$f":"IF($E$9=\"\",\"\",Hilfsliste_Gruppen!C12)","v":""},{"$f":"IF($E$9=\"\",\"\",Hilfsliste_Gruppen!D12)","v":""},{"$f":"IF($E$9=\"\",\"\",Hilfsliste_Gruppen!E12)","v":""}]
[5,null,{"$f":"IF($E$9=\"\",\"\",Hilfsliste_Gruppen!B13)","v":""},{"$f":"IF($E$9=\"\",\"\",Hilfsliste_Gruppen!C13)","v":""},{"$f":"IF($E$9=\"\",\"\",Hilfsliste_Gruppen!D13)","v":""},{"$f":"IF($E$9=\"\",\"\",Hilfsliste_Gruppen!E13)","v":""}]
{"$rows_left_out":34}
{"sheet":"Auswahlfelder","index":4,"n_rows":7,"n_cols":3,"rows_kept":7,"cut":false,"hidden":true,"merged":[]}
["Anzahl Gruppen",null,"Stellung"]
[" ",null," "]
[1,null,"frei"]
[2,null,"aufg."]
[3]
[4]
[5]

{"sheet":"Altersstufe","index":5,"n_rows":94,"n_cols":6,"rows_kept":94,"cut":false,"hidden":true,"merged":[[19,1,43,2],[44,1,57,2],[58,1,67,2],[68,1,93,2],[4,1,4,2],[6,1,18,1],[6,2,7,2],[8,2,10,2],[11,2,12,2],[13,2,14,2],[15,2,16,2],[17,2,18,2]]}
["Berechnung Altersstufe aus dem Altersjahr oder dem Jahrgang "]
[]
["Wettkampf-\nJahr",{"$f":"Vereinsanmeldung!G14","v":2024}]
[]
[null,"Altersstufen",null,"Altersjahr","Jahrgang","Kategorie"]
[null,null,null,0,0," "]
[null,"Junioren U10 - U21","U10",8,{"$f":"+$B$3-D7","v":2016},"U17"]
[null,null,null,{"$f":"+D7+1","v":9},2015,"U17"]
[null,null,"U13",10,2014,"U17"]
[null,null,null,11,2013,"U17"]
[null,null,null,12,2012,"U17"]
[null,null,"U15",13,2011,"U17"]
[null,null,null,14,2010,"U17"]
[null,null,"U17",15,2009,"U17"]
[null,null,null,16,2008,"U17"]
{"$rows_left_out":80}
{"sheet":"Hilfsliste_Gruppen","index":6,"n_rows":13,"n_cols":25,"rows_kept":13,"cut":false,"hidden":true,"merged":[]}
[1.1000000000000001,{"$f":"VLOOKUP(A1,Personenerfassung!$C$6:$I$35,3,FALSE)","v":{"$error":"#N/A"}},{"$f":"VLOOKUP(A1,Personenerfassung!$C$6:$I$35,4,FALSE)","v":{"$error":"#N/A"}},{"$f":"VLOOKUP(A1,Personenerfassung!$C$6:$I$35,5,FALSE)","v":{"$error":"#N/A"}},{"$f":"VLOOKUP(A1,Personenerfassung!$C$6:$I$35,7,FALSE)","v":{"$error":"#N/A"}},2.1,{"$f":"VLOOKUP(F1,Personenerfassung!$C$6:$I$35,3,FALSE)","v":{"$error":"#N/A"}},{"$f":"VLOOKUP(F1,Personenerfassung!$C$6:$I$35,4,FALSE)","v":{"$error":"#N/A"}},{"$f":"VLOOKUP(F1,Personenerfassung!$C$6:$I$35,5,FALSE)","v":{"$error":"#N/A"}},{"$f":"VLOOKUP(F1,Personenerfassung!$C$6:$I$35,7,FALSE)","v":{"$error":"#N/A"}},3.1,{"$f":"VLOOKUP(K1,Personenerfassung!$C$6:$I$35,3,FALSE)","v":{"$error":"#N/A"}},{"$f":"VLOOKUP(K1,Personenerfassung!$C$6:$I$35,4,FALSE)","v":{"$error":"#N/A"}},{"$f":"VLOOKUP(K1,Personenerfassung!$C$6:$I$35,5,FALSE)","v":{"$error":"#N/A"}},{"$f":"VLOOKUP(K1,Personenerfassung!$C$6:$I$35,7,FALSE)","v":{"$error":"#N/A"}},4.0999999999999996,{"$f":"VLOOKUP(P1,Personenerfassung!$C$6:$I$35,3,FALSE)","v":{"$error":"#N/A"}},{"$f":"VLOOKUP(P1,Personenerfassung!$C$6:$I$35,4,FALSE)","v":{"$error":"#N/A"}},{"$f":"VLOOKUP(P1,Personenerfassung!$C$6:$I$35,5,FALSE)","v":{"$error":"#N/A"}},{"$f":"VLOOKUP(P1,Personenerfassung!$C$6:$I$35,7,FALSE)","v":{"$error":"#N/A"}},5.0999999999999996,{"$f":"VLOOKUP(U1,Personenerfassung!$C$6:$I$35,3,FALSE)","v":{"$error":"#N/A"}},{"$f":"VLOOKUP(U1,Personenerfassung!$C$6:$I$35,4,FALSE)","v":{"$error":"#N/A"}},{"$f":"VLOOKUP(U1,Personenerfassung!$C$6:$I$35,5,FALSE)","v":{"$error":"#N/A"}},{"$f":"VLOOKUP(U1,Personenerfassung!$C$6:$I$35,7,FALSE)","v":{"$error":"#N/A"}}]
[1.2,{"$f":"VLOOKUP(A2,Personenerfassung!$C$6:$I$35,3,FALSE)","v":{"$error":"#N/A"}},{"$f":"VLOOKUP(A2,Personenerfassung!$C$6:$I$35,4,FALSE)","v":{"$error":"#N/A"}},{"$f":"VLOOKUP(A2,Personenerfassung!$C$6:$I$35,5,FALSE)","v":{"$error":"#N/A"}},{"$f":"VLOOKUP(A2,Personenerfassung!$C$6:$I$35,7,FALSE)","v":{"$error":"#N/A"}},2.2000000000000002,{"$f":"VLOOKUP(F2,Personenerfassung!$C$6:$I$35,3,FALSE)","v":{"$error":"#N/A"}},{"$f":"VLOOKUP(F2,Personenerfassung!$C$6:$I$35,4,FALSE)","v":{"$error":"#N/A"}},{"$f":"VLOOKUP(F2,Personenerfassung!$C$6:$I$35,5,FALSE)","v":{"$error":"#N/A"}},{"$f":"VLOOKUP(F2,Personenerfassung!$C$6:$I$35,7,FALSE)","v":{"$error":"#N/A"}},3.2,{"$f":"VLOOKUP(K2,Personenerfassung!$C$6:$I$35,3,FALSE)","v":{"$error":"#N/A"}},{"$f":"VLOOKUP(K2,Personenerfassung!$C$6:$I$35,4,FALSE)","v":{"$error":"#N/A"}},{"$f":"VLOOKUP(K2,Personenerfassung!$C$6:$I$35,5,FALSE)","v":{"$error":"#N/A"}},{"$f":"VLOOKUP(K2,Personenerfassung!$C$6:$I$35,7,FALSE)","v":{"$error":"#N/A"}},4.2,{"$f":"VLOOKUP(P2,Personenerfassung!$C$6:$I$35,3,FALSE)","v":{"$error":"#N/A"}},{"$f":"VLOOKUP(P2,Personenerfassung!$C$6:$I$35,4,FALSE)","v":{"$error":"#N/A"}},{"$f":"VLOOKUP(P2,Personenerfassung!$C$6:$I$35,5,FALSE)","v":{"$error":"#N/A"}},{"$f":"VLOOKUP(P2,Personenerfassung!$C$6:$I$35,7,FALSE)","v":{"$error":"#N/A"}},5.2,{"$f":"VLOOKUP(U2,Personenerfassung!$C$6:$I$35,3,FALSE)","v":{"$error":"#N/A"}},{"$f":"VLOOKUP(U2,Personenerfassung!$C$6:$I$35,4,FALSE)","v":{"$error":"#N/A"}},{"$f":"VLOOKUP(U2,Personenerfassung!$C$6:$I$35,5,FALSE)","v":{"$error":"#N/A"}},{"$f":"VLOOKUP(U2,Personenerfassung!$C$6:$I$35,7,FALSE)","v":{"$error":"#N/A"}}]
[1.3,{"$f":"VLOOKUP(A3,Personenerfassung!$C$6:$I$35,3,FALSE)","v":{"$error":"#N/A"}},{"$f":"VLOOKUP(A3,Personenerfassung!$C$6:$I$35,4,FALSE)","v":{"$error":"#N/A"}},{"$f":"VLOOKUP(A3,Personenerfassung!$C$6:$I$35,5,FALSE)","v":{"$error":"#N/A"}},{"$f":"VLOOKUP(A3,Personenerfassung!$C$6:$I$35,7,FALSE)","v":{"$error":"#N/A"}},2.2999999999999998,{"$f":"VLOOKUP(F3,Personenerfassung!$C$6:$I$35,3,FALSE)","v":{"$error":"#N/A"}},{"$f":"VLOOKUP(F3,Personenerfassung!$C$6:$I$35,4,FALSE)","v":{"$error":"#N/A"}},{"$f":"VLOOKUP(F3,Personenerfassung!$C$6:$I$35,5,FALSE)","v":{"$error":"#N/A"}},{"$f":"VLOOKUP(F3,Personenerfassung!$C$6:$I$35,7,FALSE)","v":{"$error":"#N/A"}},3.3,{"$f":"VLOOKUP(K3,Personenerfassung!$C$6:$I$35,3,FALSE)","v":{"$error":"#N/A"}},{"$f":"VLOOKUP(K3,Personenerfassung!$C$6:$I$35,4,FALSE)","v":{"$error":"#N/A"}},{"$f":"VLOOKUP(K3,Personenerfassung!$C$6:$I$35,5,FALSE)","v":{"$error":"#N/A"}},{"$f":"VLOOKUP(K3,Personenerfassung!$C$6:$I$35,7,FALSE)","v":{"$error":"#N/A"}},4.3,{"$f":"VLOOKUP(P3,Personenerfassung!$C$6:$I$35,3,FALSE)","v":{"$error":"#N/A"}},{"$f":"VLOOKUP(P3,Personenerfassung!$C$6:$I$35,4,FALSE)","v":{"$error":"#N/A"}},{"$f":"VLOOKUP(P3,Personenerfassung!$C$6:$I$35,5,FALSE)","v":{"$error":"#N/A"}},{"$f":"VLOOKUP(P3,Personenerfassung!$C$6:$I$35,7,FALSE)","v":{"$error":"#N/A"}},5.3,{"$f":"VLOOKUP(U3,Personenerfassung!$C$6:$I$35,3,FALSE)","v":{"$error":"#N/A"}},{"$f":"VLOOKUP(U3,Personenerfassung!$C$6:$I$35,4,FALSE)","v":{"$error":"#N/A"}},{"$f":"VLOOKUP(U3,Personenerfassung!$C$6:$I$35,5,FALSE)","v":{"$error":"#N/A"}},{"$f":"VLOOKUP(U3,Personenerfassung!$C$6:$I$35,7,FALSE)","v":{"$error":"#N/A"}}]
[1.4,{"$f":"VLOOKUP(A4,Personenerfassung!$C$6:$I$35,3,FALSE)","v":{"$error":"#N/A"}},{"$f":"VLOOKUP(A4,Personenerfassung!$C$6:$I$35,4,FALSE)","v":{"$error":"#N/A"}},{"$f":"VLOOKUP(A4,Personenerfassung!$C$6:$I$35,5,FALSE)","v":{"$error":"#N/A"}},{"$f":"VLOOKUP(A4,Personenerfassung!$C$6:$I$35,7,FALSE)","v":{"$error":"#N/A"}},2.4,{"$f":"VLOOKUP(F4,Personenerfassung!$C$6:$I$35,3,FALSE)","v":{"$error":"#N/A"}},{"$f":"VLOOKUP(F4,Personenerfassung!$C$6:$I$35,4,FALSE)","v":{"$error":"#N/A"}},{"$f":"VLOOKUP(F4,Personenerfassung!$C$6:$I$35,5,FALSE)","v":{"$error":"#N/A"}},{"$f":"VLOOKUP(F4,Personenerfassung!$C$6:$I$35,7,FALSE)","v":{"$error":"#N/A"}},3.4,{"$f":"VLOOKUP(K4,Personenerfassung!$C$6:$I$35,3,FALSE)","v":{"$error":"#N/A"}},{"$f":"VLOOKUP(K4,Personenerfassung!$C$6:$I$35,4,FALSE)","v":{"$error":"#N/A"}},{"$f":"VLOOKUP(K4,Personenerfassung!$C$6:$I$35,5,FALSE)","v":{"$error":"#N/A"}},{"$f":"VLOOKUP(K4,Personenerfassung!$C$6:$I$35,7,FALSE)","v":{"$error":"#N/A"}},4.4000000000000004,{"$f":"VLOOKUP(P4,Personenerfassung!$C$6:$I$35,3,FALSE)","v":{"$error":"#N/A"}},{"$f":"VLOOKUP(P4,Personenerfassung!$C$6:$I$35,4,FALSE)","v":{"$error":"#N/A"}},{"$f":"VLOOKUP(P4,Personenerfassung!$C$6:$I$35,5,FALSE)","v":{"$error":"#N/A"}},{"$f":"VLOOKUP(P4,Personenerfassung!$C$6:$I$35,7,FALSE)","v":{"$error":"#N/A"}},5.4,{"$f":"VLOOKUP(U4,Personenerfassung!$C$6:$I$35,3,FALSE)","v":{"$error":"#N/A"}},{"$f":"VLOOKUP(U4,Personenerfassung!$C$6:$I$35,4,FALSE)","v":{"$error":"#N/A"}},{"$f":"VLOOKUP(U4,Personenerfassung!$C$6:$I$35,5,FALSE)","v":{"$error":"#N/A"}},{"$f":"VLOOKUP(U4,Personenerfassung!$C$6:$I$35,7,FALSE)","v":{"$error":"#N/A"}}]
[1.5,{"$f":"VLOOKUP(A5,Personenerfassung!$C$6:$I$35,3,FALSE)","v":{"$error":"#N/A"}},{"$f":"VLOOKUP(A5,Personenerfassung!$C$6:$I$35,4,FALSE)","v":{"$error":"#N/A"}},{"$f":"VLOOKUP(A5,Personenerfassung!$C$6:$I$35,5,FALSE)","v":{"$error":"#N/A"}},{"$f":"VLOOKUP(A5,Personenerfassung!$C$6:$I$35,7,FALSE)","v":{"$error":"#N/A"}},2.5,{"$f":"VLOOKUP(F5,Personenerfassung!$C$6:$I$35,3,FALSE)","v":{"$error":"#N/A"}},{"$f":"VLOOKUP(F5,Personenerfassung!$C$6:$I$35,4,FALSE)","v":{"$error":"#N/A"}},{"$f":"VLOOKUP(F5,Personenerfassung!$C$6:$I$35,5,FALSE)","v":{"$error":"#N/A"}},{"$f":"VLOOKUP(F5,Personenerfassung!$C$6:$I$35,7,FALSE)","v":{"$error":"#N/A"}},3.5,{"$f":"VLOOKUP(K5,Personenerfassung!$C$6:$I$35,3,FALSE)","v":{"$error":"#N/A"}},{"$f":"VLOOKUP(K5,Personenerfassung!$C$6:$I$35,4,FALSE)","v":{"$error":"#N/A"}},{"$f":"VLOOKUP(K5,Personenerfassung!$C$6:$I$35,5,FALSE)","v":{"$error":"#N/A"}},{"$f":"VLOOKUP(K5,Personenerfassung!$C$6:$I$35,7,FALSE)","v":{"$error":"#N/A"}},4.5,{"$f":"VLOOKUP(P5,Personenerfassung!$C$6:$I$35,3,FALSE)","v":{"$error":"#N/A"}},{"$f":"VLOOKUP(P5,Personenerfassung!$C$6:$I$35,4,FALSE)","v":{"$error":"#N/A"}},{"$f":"VLOOKUP(P5,Personenerfassung!$C$6:$I$35,5,FALSE)","v":{"$error":"#N/A"}},{"$f":"VLOOKUP(P5,Personenerfassung!$C$6:$I$35,7,FALSE)","v":{"$error":"#N/A"}},5.5,{"$f":"VLOOKUP(U5,Personenerfassung!$C$6:$I$35,3,FALSE)","v":{"$error":"#N/A"}},{"$f":"VLOOKUP(U5,Personenerfassung!$C$6:$I$35,4,FALSE)","v":{"$error":"#N/A"}},{"$f":"VLOOKUP(U5,Personenerfassung!$C$6:$I$35,5,FALSE)","v":{"$error":"#N/A"}},{"$f":"VLOOKUP(U5,Personenerfassung!$C$6:$I$35,7,FALSE)","v":{"$error":"#N/A"}}]
[]
[5,6,7,8,null,12,13,14,15,null,19,20,21,22,null,26,27,28,29,null,33,34,35,36]
[]
[{"$f":"A1","v":1.1000000000000001},{"$f":"IF(ISERROR(B1),\"\",B1)","v":""},{"$f":"IF(ISERROR(C1),\"\",C1)","v":""},"","",{"$f":"F1","v":2.1},{"$f":"IF(ISERROR(G1),\"\",G1)","v":""},"","","",{"$f":"K1","v":3.1},{"$f":"IF(ISERROR(L1),\"\",L1)","v":""},"","","",{"$f":"P1","v":4.0999999999999996},{"$f":"IF(ISERROR(Q1),\"\",Q1)","v":""},"","","",{"$f":"U1","v":5.0999999999999996},{"$f":"IF(ISERROR(V1),\"\",V1)","v":""},"","",""]
[{"$f":"A2","v":1.2},{"$f":"IF(ISERROR(B2),\"\",B2)","v":""},"","","",{"$f":"F2","v":2.2000000000000002},{"$f":"IF(ISERROR(G2),\"\",G2)","v":""},"","","",{"$f":"K2","v":3.2},{"$f":"IF(ISERROR(L2),\"\",L2)","v":""},"","","",{"$f":"P2","v":4.2},{"$f":"IF(ISERROR(Q2),\"\",Q2)","v":""},"","","",{"$f":"U2","v":5.2},{"$f":"IF(ISERROR(V2),\"\",V2)","v":""},"","",""]
[1.3,{"$f":"IF(ISERROR(B3),\"\",B3)","v":""},"","","",2.2999999999999998,{"$f":"IF(ISERROR(G3),\"\",G3)","v":""},"","","",3.3,{"$f":"IF(ISERROR(L3),\"\",L3)","v":""},"","","",4.3,{"$f":"IF(ISERROR(Q3),\"\",Q3)","v":""},"","","",5.3,{"$f":"IF(ISERROR(V3),\"\",V3)","v":""},"","",""]
[1.4,{"$f":"IF(ISERROR(B4),\"\",B4)","v":""},"","","",2.4,{"$f":"IF(ISERROR(G4),\"\",G4)","v":""},"","","",3.4,{"$f":"IF(ISERROR(L4),\"\",L4)","v":""},"","","",4.4000000000000004,{"$f":"IF(ISERROR(Q4),\"\",Q4)","v":""},"","","",5.4,{"$f":"IF(ISERROR(V4),\"\",V4)","v":""},"","",""]
[1.5,{"$f":"IF(ISERROR(B5),\"\",B5)","v":""},"","","",2.5,{"$f":"IF(ISERROR(G5),\"\",G5)","v":""},"","","",3.5,{"$f":"IF(ISERROR(L5),\"\",L5)","v":""},"","","",4.5,{"$f":"IF(ISERROR(Q5),\"\",Q5)","v":""},"","","",5.5,{"$f":"IF(ISERROR(V5),\"\",V5)","v":""},"","",""]